查看: 234|回复: 7

[未解决] 求大佬帮忙,为开发板 Arduino Uno 编译时出错。

[复制链接]

该用户从未签到

发表于 2020-2-22 14:08 | 显示全部楼层 |阅读模式
如题,在运行示例程序的时候也这样
详细错误信息:
Arduino:1.8.12 (Windows 10), 开发板:"Arduino Uno"

D:\arduino-1.8.12\arduino-builder -dump-prefs -logger=machine -hardware D:\arduino-1.8.12\hardware -tools D:\arduino-1.8.12\tools-builder -tools D:\arduino-1.8.12\hardware\tools\avr -built-in-libraries D:\arduino-1.8.12\libraries -libraries C:\Users\遇见玉yu\Documents\Arduino\libraries -fqbn=arduino:avr:uno -vid-pid=1A86_7523 -ide-version=10812 -build-path C:\WINDOWS\TEMP\arduino_build_691947 -warnings=none -build-cache C:\WINDOWS\TEMP\arduino_cache_665986 -prefs=build.warn_data_percentage=75 -prefs=runtime.tools.avr-gcc.path=D:\arduino-1.8.12\hardware\tools\avr -prefs=runtime.tools.avr-gcc-7.3.0-atmel3.6.1-arduino5.path=D:\arduino-1.8.12\hardware\tools\avr -prefs=runtime.tools.avrdude.path=D:\arduino-1.8.12\hardware\tools\avr -prefs=runtime.tools.avrdude-6.3.0-arduino17.path=D:\arduino-1.8.12\hardware\tools\avr -prefs=runtime.tools.arduinoOTA.path=D:\arduino-1.8.12\hardware\tools\avr -prefs=runtime.tools.arduinoOTA-1.3.0.path=D:\arduino-1.8.12\hardware\tools\avr -verbose D:\arduino-1.8.12\examples\01.Basics\Blink\Blink.ino
D:\arduino-1.8.12\arduino-builder -compile -logger=machine -hardware D:\arduino-1.8.12\hardware -tools D:\arduino-1.8.12\tools-builder -tools D:\arduino-1.8.12\hardware\tools\avr -built-in-libraries D:\arduino-1.8.12\libraries -libraries C:\Users\遇见玉yu\Documents\Arduino\libraries -fqbn=arduino:avr:uno -vid-pid=1A86_7523 -ide-version=10812 -build-path C:\WINDOWS\TEMP\arduino_build_691947 -warnings=none -build-cache C:\WINDOWS\TEMP\arduino_cache_665986 -prefs=build.warn_data_percentage=75 -prefs=runtime.tools.avr-gcc.path=D:\arduino-1.8.12\hardware\tools\avr -prefs=runtime.tools.avr-gcc-7.3.0-atmel3.6.1-arduino5.path=D:\arduino-1.8.12\hardware\tools\avr -prefs=runtime.tools.avrdude.path=D:\arduino-1.8.12\hardware\tools\avr -prefs=runtime.tools.avrdude-6.3.0-arduino17.path=D:\arduino-1.8.12\hardware\tools\avr -prefs=runtime.tools.arduinoOTA.path=D:\arduino-1.8.12\hardware\tools\avr -prefs=runtime.tools.arduinoOTA-1.3.0.path=D:\arduino-1.8.12\hardware\tools\avr -verbose D:\arduino-1.8.12\examples\01.Basics\Blink\Blink.ino
Using board 'uno' from platform in folder: D:\arduino-1.8.12\hardware\arduino\avr
Using core 'arduino' from platform in folder: D:\arduino-1.8.12\hardware\arduino\avr
Detecting libraries used...
"D:\\arduino-1.8.12\\hardware\\tools\\avr/bin/avr-g++" -c -g -Os -w -std=gnu++11 -fpermissive -fno-exceptions -ffunction-sections -fdata-sections -fno-threadsafe-statics -Wno-error=narrowing -flto -w -x c++ -E -CC -mmcu=atmega328p -DF_CPU=16000000L -DARDUINO=10812 -DARDUINO_AVR_UNO -DARDUINO_ARCH_AVR "-ID:\\arduino-1.8.12\\hardware\\arduino\\avr\\cores\\arduino" "-ID:\\arduino-1.8.12\\hardware\\arduino\\avr\\variants\\standard" "C:\\WINDOWS\\TEMP\\arduino_build_691947\\sketch\\Blink.ino.cpp" -o nul
Generating function prototypes...
"D:\\arduino-1.8.12\\hardware\\tools\\avr/bin/avr-g++" -c -g -Os -w -std=gnu++11 -fpermissive -fno-exceptions -ffunction-sections -fdata-sections -fno-threadsafe-statics -Wno-error=narrowing -flto -w -x c++ -E -CC -mmcu=atmega328p -DF_CPU=16000000L -DARDUINO=10812 -DARDUINO_AVR_UNO -DARDUINO_ARCH_AVR "-ID:\\arduino-1.8.12\\hardware\\arduino\\avr\\cores\\arduino" "-ID:\\arduino-1.8.12\\hardware\\arduino\\avr\\variants\\standard" "C:\\WINDOWS\\TEMP\\arduino_build_691947\\sketch\\Blink.ino.cpp" -o "C:\\WINDOWS\\TEMP\\arduino_build_691947\\preproc\\ctags_target_for_gcc_minus_e.cpp"
"D:\\arduino-1.8.12\\tools-builder\\ctags\\5.8-arduino11/ctags" -u --language-force=c++ -f - --c++-kinds=svpf --fields=KSTtzns --line-directives "C:\\WINDOWS\\TEMP\\arduino_build_691947\\preproc\\ctags_target_for_gcc_minus_e.cpp"
正在编译项目...
"D:\\arduino-1.8.12\\hardware\\tools\\avr/bin/avr-g++" -c -g -Os -w -std=gnu++11 -fpermissive -fno-exceptions -ffunction-sections -fdata-sections -fno-threadsafe-statics -Wno-error=narrowing -MMD -flto -mmcu=atmega328p -DF_CPU=16000000L -DARDUINO=10812 -DARDUINO_AVR_UNO -DARDUINO_ARCH_AVR "-ID:\\arduino-1.8.12\\hardware\\arduino\\avr\\cores\\arduino" "-ID:\\arduino-1.8.12\\hardware\\arduino\\avr\\variants\\standard" "C:\\WINDOWS\\TEMP\\arduino_build_691947\\sketch\\Blink.ino.cpp" -o "C:\\WINDOWS\\TEMP\\arduino_build_691947\\sketch\\Blink.ino.cpp.o"
Compiling libraries...
Compiling core...
Using precompiled core: C:\WINDOWS\TEMP\arduino_cache_665986\core\core_arduino_avr_uno_e0a586691f84d83ccfc558fcf90dd704.a
Linking everything together...
"D:\\arduino-1.8.12\\hardware\\tools\\avr/bin/avr-gcc" -w -Os -g -flto -fuse-linker-plugin -Wl,--gc-sections -mmcu=atmega328p -o "C:\\WINDOWS\\TEMP\\arduino_build_691947/Blink.ino.elf" "C:\\WINDOWS\\TEMP\\arduino_build_691947\\sketch\\Blink.ino.cpp.o" "C:\\WINDOWS\\TEMP\\arduino_build_691947/..\\arduino_cache_665986\\core\\core_arduino_avr_uno_e0a586691f84d83ccfc558fcf90dd704.a" "-LC:\\WINDOWS\\TEMP\\arduino_build_691947" -lm
avr-gcc: error: @C:\WINDOWS\TEMP\ccmiXRaX: Invalid argument

avr-gcc: fatal error: no input files

compilation terminated.

lto-wrapper.exe: fatal error: D:\arduino-1.8.12\hardware\tools\avr/bin/avr-gcc returned 1 exit status

compilation terminated.

d:/arduino-1.8.12/hardware/tools/avr/bin/../lib/gcc/avr/7.3.0/../../../../avr/bin/ld.exe: error: lto-wrapper failed

collect2.exe: error: ld returned 1 exit status

exit status 1
为开发板 Arduino Uno 编译时出错。

  • TA的每日心情
    开心
    2020-3-18 09:02
  • 签到天数: 806 天

    [LV.10]以坛为家III

    发表于 2020-2-22 14:20 | 显示全部楼层
    你这是blinker吧 怎么感觉你用了uno板子

    该用户从未签到

     楼主| 发表于 2020-2-22 17:31 来自手机 | 显示全部楼层
    单片机菜鸟 发表于 2020-2-22 14:20
    你这是blinker吧 怎么感觉你用了uno板子

    是Uno,但是我试了好几个程序,包括示例程序都这样报错
  • TA的每日心情
    开心
    2020-3-18 09:02
  • 签到天数: 806 天

    [LV.10]以坛为家III

    发表于 2020-2-22 18:24 | 显示全部楼层
    遇见玉 发表于 2020-2-22 17:31
    是Uno,但是我试了好几个程序,包括示例程序都这样报错

    blinker不是一般连wifi吗????
  • TA的每日心情
    开心
    2020-4-6 20:04
  • 签到天数: 127 天

    [LV.7]常住居民III

    发表于 2020-2-22 18:52 来自手机 | 显示全部楼层
    你用了哪个例程啊!

    该用户从未签到

     楼主| 发表于 2020-2-23 13:23 | 显示全部楼层
    daileshan 发表于 2020-2-22 18:52
    你用了哪个例程啊!

    我试了五六个,都报错了,这个是blink

    该用户从未签到

     楼主| 发表于 2020-2-23 13:24 | 显示全部楼层
    单片机菜鸟 发表于 2020-2-22 18:24
    blinker不是一般连wifi吗????

    这个是示例程序,blink
  • TA的每日心情
    开心
    2020-4-6 20:04
  • 签到天数: 127 天

    [LV.7]常住居民III

    发表于 2020-2-24 08:41 来自手机 | 显示全部楼层
    遇见玉 发表于 2020-2-23 13:23
    我试了五六个,都报错了,这个是blink

    那就只能重新装一下ArduinoIDE了。
    您需要登录后才可以回帖 登录 | 立即注册

    本版积分规则

    热门推荐

    《Color Unit免费申请试用》
    《Color Unit免费申请试用
    COLOR 是一款颜色识别 Unit,其内部集成TCS3472彩色光数字转换器,能够将其检测到颜色
    编译时空白行出现stray '\345' in program
    编译时空白行出现stray &#
    【原创】 drawbot平面关节scara机械臂写字机 画画机器人直播...
    【原创】 drawbot平面关节
    这个项目上个月就在做了,结构和代码反反复复改了多次,加上自己又太忙,一直没来得及
    siri+小爱+小度+天猫控制灯
    siri+小爱+小度+天猫控制
    以上是颜色代码 本程序控制的是8266的 io 0 默认上电LOW 有需求可以知己改写 siri
    siri控制8266
    siri控制8266
    //本程序是操作8266的GPIO 0 口// 程序如下 #include const char* ssid = "TP-11222";
    Copyright   ©2015-2016  Arduino中文社区  Powered by©Discuz!   
    快速回复 返回顶部 返回列表